{"text_format":"1","workbook":"xlsx","n_sheets":14,"sheets":["Startblatt","Deckblatt","Meldung","EK w","EK m","Paarkür","Kleingrp","Großgrp","Juryabfrage","Startgebühr","Kürmusik","Ausfüll-Hilfe","Check-Liste","Daten"],"not_rendered":{"charts":0,"images":9,"macros":1,"external_links":0,"defined_names":28,"comments":1,"pivot_tables":0},"unopened":[],"bounds":{"document_bytes":16777216,"sheet_cells":100000,"rows_first":2000,"rows_last":500,"rows_between":2000,"halvings":0,"cell_chars":16384,"cell_head_chars":4096},"cells_cut":0,"cells_raw":0,"read":"whole","date_system":"1900"}

{"sheet":"Startblatt","index":0,"n_rows":3,"n_cols":2,"rows_kept":3,"cut":false,"hidden":false,"merged":[]}
[]
[]
[null,"Bitte aktivieren Sie Makros \nund öffnen Sie die Datei in MS Excel, \num die Inhalte zu sehen."]

{"sheet":"Deckblatt","index":1,"n_rows":35,"n_cols":5,"rows_kept":35,"cut":false,"hidden":true,"merged":[[25,3,25,6],[15,2,15,3],[1,2,1,3],[8,2,8,3],[9,2,9,3],[10,2,10,3],[11,2,11,3],[12,2,12,3],[13,2,13,3],[14,2,14,3],[2,1,2,2]]}
["Süddeutsche Meisterschaft Einrad Freestyle 🧡"]
[null,"2026-10-16","2026-10-18"]
[null,"Nächster Wettkampf ist die DM in Offenburg:",null,"2026-11-27"]
[]
[null,"Anmeldung"]
[]
{"$rows_left_out":30}
{"sheet":"Meldung","index":2,"n_rows":52,"n_cols":40,"rows_kept":52,"cut":false,"hidden":true,"merged":[]}
["Lfd. Nr.","Name","Vorname","Geb. Datum","Alter am ersten Wettkampftag","Geschlecht","Einzelkür","EK-Kürname","Paarkür","PK-Kürname","Kleingruppe","Großgruppe","Startgebühr","Spalte1","15 €","15 €2","10 €","10 €_","Wettkampfdatum","Spalte2","Spalte3","16.10.2026","16.10.2027","16.10.2028","16.10.2029","16.10.2030","Textkette","Alter am Wettkampftag 1","Plausi Geburtsdatum","27.11.2026","Alter am Wettkampftag 2","Altersklasse_1","Altersklasse_2","Altersklassensprung","01.04.1999","1","4","2026","01.04.2026","Alter am 01.04. im Wettkampf-Jahr"]
[{"$f":"$U$2&1","v":"1"},null,null,null,{"$f":"IF( D2>1940,DATEDIF(D2,V$1,\"y\"),\" \")","v":" "},null,null,null,null,null,null,null,{"$f":"IFERROR(IF(B2=\"\",\"\",IF(Teilnehmer[[#This Row],[Einzelkür]]=\"ja\",Deckblatt!$C$20,IF(NOT(Teilnehmer[[#This Row],[EK-Kürname]]=\"\"),12)))+(IF(NOT(Teilnehmer[[#This Row],[Paarkür]]=\"\"),Deckblatt!$C$21,0))+(IF(NOT(Teilnehmer[[#This Row],[Kleingruppe]]=\"\"),Deckblatt!$C$22,0))+(IF(NOT(Teilnehmer[[#This Row],[Großgruppe]]=\"\"),Deckblatt!$C$23,0)),\"\")","v":""},null,{"$f":"COUNTIF(Teilnehmer[[#This Row],[Einzelkür]:[EK-Kürname]],\"ja\")","v":0},{"$f":"COUNTIF(Teilnehmer[[#This Row],[Paarkür]:[PK-Kürname]],\"<>\")","v":0},{"$f":"COUNTIF(Teilnehmer[[#This Row],[Kleingruppe]],\"<>\")","v":0},{"$f":"COUNTIF(Teilnehmer[[#This Row],[Großgruppe]],\"<>\")","v":0},"Vereinskürzel",null,null,null,null,null,null,null,{"$f":"SUBSTITUTE(_xlfn.TEXTJOIN(\"\",TRUE,B2,C2),\" \",\"\")","v":""},{"$f":"Teilnehmer[[#This Row],[Geb. Datum]]","v":"00:00:00"},{"$f":"IFERROR(VLOOKUP($AA2,GebDatum_Datenbank[[Spalte1]:[Datenbasis]],4,FALSE),\"\")","v":""},null,{"$f":"IF( D2>1940,DATEDIF(D2,AD$1,\"y\"),\" \")","v":" "},{"$f":"IF(E2<11,\"U11\",IF(E2<13,\"U13\",IF(E2<15,\"U15\",IF(E2<17,\"U17\",IF(E2<19,\"U19\",IF(E2<21,\"U21\",IF(E2<23,\"U23\",IF(E2<25,\"U25\",IF(E2<30,\"U30\",IF(E2<50,\"U50\",IF(E2<70,\"U70\",IF(E2<99,\"70+\",\"\"))))))))))))","v":""},{"$f":"IF(AE2<11,\"U11\",IF(AE2<13,\"U13\",IF(AE2<15,\"U15\",IF(AE2<17,\"U17\",IF(AE2<19,\"U19\",IF(AE2<21,\"U21\",IF(AE2<23,\"U23\",IF(AE2<25,\"U25\",IF(AE2<30,\"U30\",IF(AE2<50,\"U50\",IF(AE2<70,\"U70\",IF(AE2<99,\"70+\",\"\"))))))))))))","v":""},{"$f":"IF(AF2=AG2,\"\",\"*\")","v":""},null,null,null,null,null,{"$f":"IF( D2>1940,DATEDIF(D2,AM$1,\"y\"),\" \")","v":" "}]
[{"$f":"$U$2&2","v":"2"},null,null,null," ",null,null,null,null,null,null,null,{"$f":"IFERROR(IF(B3=\"\",\"\",IF(Teilnehmer[[#This Row],[Einzelkür]]=\"ja\",Deckblatt!$C$20,IF(NOT(Teilnehmer[[#This Row],[EK-Kürname]]=\"\"),12)))+(IF(NOT(Teilnehmer[[#This Row],[Paarkür]]=\"\"),Deckblatt!$C$21,0))+(IF(NOT(Teilnehmer[[#This Row],[Kleingruppe]]=\"\"),Deckblatt!$C$22,0))+(IF(NOT(Teilnehmer[[#This Row],[Großgruppe]]=\"\"),Deckblatt!$C$23,0)),\"\")","v":""},null,{"$f":"COUNTIF(Teilnehmer[[#This Row],[Einzelkür]:[EK-Kürname]],\"ja\")","v":0},{"$f":"COUNTIF(Teilnehmer[[#This Row],[Paarkür]:[PK-Kürname]],\"<>\")","v":0},{"$f":"COUNTIF(Teilnehmer[[#This Row],[Kleingruppe]],\"<>\")","v":0},{"$f":"COUNTIF(Teilnehmer[[#This Row],[Großgruppe]],\"<>\")","v":0},null,null,null,null,null,null,null,null,"",{"$f":"Teilnehmer[[#This Row],[Geb. Datum]]","v":"00:00:00"},{"$f":"IFERROR(VLOOKUP($AA3,GebDatum_Datenbank[[Spalte1]:[Datenbasis]],4,FALSE),\"\")","v":""},null," ",{"$f":"IF(E3<11,\"U11\",IF(E3<13,\"U13\",IF(E3<15,\"U15\",IF(E3<17,\"U17\",IF(E3<19,\"U19\",IF(E3<21,\"U21\",IF(E3<23,\"U23\",IF(E3<25,\"U25\",IF(E3<30,\"U30\",IF(E3<50,\"U50\",IF(E3<70,\"U70\",IF(E3<99,\"70+\",\"\"))))))))))))","v":""},{"$f":"IF(AE3<11,\"U11\",IF(AE3<13,\"U13\",IF(AE3<15,\"U15\",IF(AE3<17,\"U17\",IF(AE3<19,\"U19\",IF(AE3<21,\"U21\",IF(AE3<23,\"U23\",IF(AE3<25,\"U25\",IF(AE3<30,\"U30\",IF(AE3<50,\"U50\",IF(AE3<70,\"U70\",IF(AE3<99,\"70+\",\"\"))))))))))))","v":""},{"$f":"IF(AF3=AG3,\"\",\"*\")","v":""},null,null,null,null,null," "]
[{"$f":"$U$2&3","v":"3"},null,null,null," ",null,null,null,null,null,null,null,{"$f":"IFERROR(IF(B4=\"\",\"\",IF(Teilnehmer[[#This Row],[Einzelkür]]=\"ja\",Deckblatt!$C$20,IF(NOT(Teilnehmer[[#This Row],[EK-Kürname]]=\"\"),12)))+(IF(NOT(Teilnehmer[[#This Row],[Paarkür]]=\"\"),Deckblatt!$C$21,0))+(IF(NOT(Teilnehmer[[#This Row],[Kleingruppe]]=\"\"),Deckblatt!$C$22,0))+(IF(NOT(Teilnehmer[[#This Row],[Großgruppe]]=\"\"),Deckblatt!$C$23,0)),\"\")","v":""},null,{"$f":"COUNTIF(Teilnehmer[[#This Row],[Einzelkür]:[EK-Kürname]],\"ja\")","v":0},{"$f":"COUNTIF(Teilnehmer[[#This Row],[Paarkür]:[PK-Kürname]],\"<>\")","v":0},{"$f":"COUNTIF(Teilnehmer[[#This Row],[Kleingruppe]],\"<>\")","v":0},{"$f":"COUNTIF(Teilnehmer[[#This Row],[Großgruppe]],\"<>\")","v":0},null,null,"w","n",null,null,1,null,"",{"$f":"Teilnehmer[[#This Row],[Geb. Datum]]","v":"00:00:00"},{"$f":"IFERROR(VLOOKUP($AA4,GebDatum_Datenbank[[Spalte1]:[Datenbasis]],4,FALSE),\"\")","v":""},null," ","","","",null,null,null,null,null," "]
[{"$f":"$U$2&4","v":"4"},null,null,null," ",null,null,null,null,null,null,null,{"$f":"IFERROR(IF(B5=\"\",\"\",IF(Teilnehmer[[#This Row],[Einzelkür]]=\"ja\",Deckblatt!$C$20,IF(NOT(Teilnehmer[[#This Row],[EK-Kürname]]=\"\"),12)))+(IF(NOT(Teilnehmer[[#This Row],[Paarkür]]=\"\"),Deckblatt!$C$21,0))+(IF(NOT(Teilnehmer[[#This Row],[Kleingruppe]]=\"\"),Deckblatt!$C$22,0))+(IF(NOT(Teilnehmer[[#This Row],[Großgruppe]]=\"\"),Deckblatt!$C$23,0)),\"\")","v":""},null,{"$f":"COUNTIF(Teilnehmer[[#This Row],[Einzelkür]:[EK-Kürname]],\"ja\")","v":0},{"$f":"COUNTIF(Teilnehmer[[#This Row],[Paarkür]:[PK-Kürname]],\"<>\")","v":0},{"$f":"COUNTIF(Teilnehmer[[#This Row],[Kleingruppe]],\"<>\")","v":0},{"$f":"COUNTIF(Teilnehmer[[#This Row],[Großgruppe]],\"<>\")","v":0},null,null,"m","ja","KG1","GG1",2,null,"",{"$f":"Teilnehmer[[#This Row],[Geb. Datum]]","v":"00:00:00"},{"$f":"IFERROR(VLOOKUP($AA5,GebDatum_Datenbank[[Spalte1]:[Datenbasis]],4,FALSE),\"\")","v":""},null," ","","","",null,null,null,null,null," "]
[{"$f":"$U$2&5","v":"5"},null,null,null," ",null,null,null,null,null,null,null,{"$f":"IFERROR(IF(B6=\"\",\"\",IF(Teilnehmer[[#This Row],[Einzelkür]]=\"ja\",Deckblatt!$C$20,IF(NOT(Teilnehmer[[#This Row],[EK-Kürname]]=\"\"),12)))+(IF(NOT(Teilnehmer[[#This Row],[Paarkür]]=\"\"),Deckblatt!$C$21,0))+(IF(NOT(Teilnehmer[[#This Row],[Kleingruppe]]=\"\"),Deckblatt!$C$22,0))+(IF(NOT(Teilnehmer[[#This Row],[Großgruppe]]=\"\"),Deckblatt!$C$23,0)),\"\")","v":""},null,{"$f":"COUNTIF(Teilnehmer[[#This Row],[Einzelkür]:[EK-Kürname]],\"ja\")","v":0},{"$f":"COUNTIF(Teilnehmer[[#This Row],[Paarkür]:[PK-Kürname]],\"<>\")","v":0},{"$f":"COUNTIF(Teilnehmer[[#This Row],[Kleingruppe]],\"<>\")","v":0},{"$f":"COUNTIF(Teilnehmer[[#This Row],[Großgruppe]],\"<>\")","v":0},null,null," ",null,"KG2","GG2",3,null,"",{"$f":"Teilnehmer[[#This Row],[Geb. Datum]]","v":"00:00:00"},{"$f":"IFERROR(VLOOKUP($AA6,GebDatum_Datenbank[[Spalte1]:[Datenbasis]],4,FALSE),\"\")","v":""},null," ","","","",null,null,null,null,null," "]
{"$rows_left_out":47}
{"sheet":"EK w","index":3,"n_rows":35,"n_cols":13,"rows_kept":35,"cut":false,"hidden":true,"merged":[[1,4,1,5]]}
["Süddeutsche Meisterschaft Einrad Freestyle 🧡"]
["Einzelküren weiblich.",null,null,{"$f":"Meldung!V1","v":"16.10.2026"},{"$f":"Deckblatt!C2","v":"2026-10-18"},null,"w"]
[]
["Kür Nr.","lf.Nr. Anmeldung","Name","Vorname","Alter","Kürname","Altersklasse","Altersklassensprung *\nzum nächsten Wettkampf"]
[1,{"$f":"IFERROR(INDEX(Teilnehmer[Lfd. Nr.],_xlfn.AGGREGATE(15,6,ROW(Teilnehmer[Lfd. Nr.])/((Teilnehmer[Geschlecht]=$G$2)*(Teilnehmer[Einzelkür]=\"ja\")),ROW()-4)-1,1),\"\")","v":""},{"$f":"IFERROR(VLOOKUP($B5,Teilnehmer[],2,FALSE),\"\")","v":""},{"$f":"IFERROR(VLOOKUP($B5,Teilnehmer[],3,FALSE),\"\")","v":""},{"$f":"IFERROR(VLOOKUP($B5,Teilnehmer[],5,FALSE),\"\")","v":""},{"$f":"IFERROR(VLOOKUP($B5,Teilnehmer[],8,FALSE),\"\")","v":""},{"$f":"IF(E5<11,\"U11\",IF(E5<13,\"U13\",IF(E5<15,\"U15\",IF(E5<17,\"U17\",IF(E5<19,\"U19\",IF(E5<21,\"U21\",IF(E5<23,\"U23\",IF(E5<25,\"U25\",IF(E5<30,\"U30\",IF(E5<50,\"U50\",IF(E5<70,\"U70\",IF(E5<99,\"70+\",\"\"))))))))))))","v":""},{"$f":"IFERROR(VLOOKUP(B5,Meldung!A2:AH51,34,FALSE),\"\")","v":""},null,null,null,null,"nein"]
[{"$f":"A5+1","v":2},{"$f":"IFERROR(INDEX(Teilnehmer[Lfd. Nr.],_xlfn.AGGREGATE(15,6,ROW(Teilnehmer[Lfd. Nr.])/((Teilnehmer[Geschlecht]=$G$2)*(Teilnehmer[Einzelkür]=\"ja\")),ROW()-4)-1,1),\"\")","v":""},{"$f":"IFERROR(VLOOKUP($B6,Teilnehmer[],2,FALSE),\"\")","v":""},{"$f":"IFERROR(VLOOKUP($B6,Teilnehmer[],3,FALSE),\"\")","v":""},{"$f":"IFERROR(VLOOKUP($B6,Teilnehmer[],5,FALSE),\"\")","v":""},{"$f":"IFERROR(VLOOKUP($B6,Teilnehmer[],8,FALSE),\"\")","v":""},{"$f":"IF(E6<11,\"U11\",IF(E6<13,\"U13\",IF(E6<15,\"U15\",IF(E6<17,\"U17\",IF(E6<19,\"U19\",IF(E6<21,\"U21\",IF(E6<23,\"U23\",IF(E6<25,\"U25\",IF(E6<30,\"U30\",IF(E6<50,\"U50\",IF(E6<70,\"U70\",IF(E6<99,\"70+\",\"\"))))))))))))","v":""},{"$f":"IFERROR(VLOOKUP(B6,Meldung!A3:AH52,34,FALSE),\"\")","v":""},null,null,null,null,"ja"]
{"$rows_left_out":30}
{"sheet":"EK m","index":4,"n_rows":35,"n_cols":13,"rows_kept":35,"cut":false,"hidden":true,"merged":[[1,4,1,5],[33,1,33,2],[36,2,36,3],[38,1,38,2],[41,2,41,3],[18,1,18,2],[21,2,21,3],[23,1,23,2],[26,2,26,3],[28,1,28,2],[31,2,31,3]]}
["Süddeutsche Meisterschaft Einrad Freestyle 🧡"]
["Einzelküren männlich.",null,null,{"$f":"Meldung!V1","v":"16.10.2026"},{"$f":"Deckblatt!C2","v":"2026-10-18"},null,"m"]
[]
["Kür Nr.","lf.Nr. Anmeldung","Name","Vorname","Alter","Kürname","Altersklasse","Altersklassensprung *\nzum nächsten Wettkampf"]
[1,{"$f":"IFERROR(INDEX(Teilnehmer[Lfd. Nr.],_xlfn.AGGREGATE(15,6,ROW(Teilnehmer[Lfd. Nr.])/((Teilnehmer[Geschlecht]=$G$2)*(Teilnehmer[Einzelkür]=\"ja\")),ROW()-4)-1,1),\"\")","v":""},{"$f":"IFERROR(VLOOKUP($B5,Teilnehmer[],2,FALSE),\"\")","v":""},{"$f":"IFERROR(VLOOKUP($B5,Teilnehmer[],3,FALSE),\"\")","v":""},{"$f":"IFERROR(VLOOKUP($B5,Teilnehmer[],5,FALSE),\"\")","v":""},{"$f":"IFERROR(VLOOKUP($B5,Teilnehmer[],8,FALSE),\"\")","v":""},{"$f":"IF(E5<11,\"U11\",IF(E5<13,\"U13\",IF(E5<15,\"U15\",IF(E5<17,\"U17\",IF(E5<19,\"U19\",IF(E5<21,\"U21\",IF(E5<23,\"U23\",IF(E5<25,\"U25\",IF(E5<30,\"U30\",IF(E5<50,\"U50\",IF(E5<70,\"U70\",IF(E5<99,\"70+\",\"\"))))))))))))","v":""},{"$f":"IFERROR(VLOOKUP(B5,Meldung!A2:AH51,34,FALSE),\"\")","v":""},null,null,null,null,"nein"]
[{"$f":"A5+1","v":2},{"$f":"IFERROR(INDEX(Teilnehmer[Lfd. Nr.],_xlfn.AGGREGATE(15,6,ROW(Teilnehmer[Lfd. Nr.])/((Teilnehmer[Geschlecht]=$G$2)*(Teilnehmer[Einzelkür]=\"ja\")),ROW()-4)-1,1),\"\")","v":""},{"$f":"IFERROR(VLOOKUP($B6,Teilnehmer[],2,FALSE),\"\")","v":""},{"$f":"IFERROR(VLOOKUP($B6,Teilnehmer[],3,FALSE),\"\")","v":""},{"$f":"IFERROR(VLOOKUP($B6,Teilnehmer[],5,FALSE),\"\")","v":""},{"$f":"IFERROR(VLOOKUP($B6,Teilnehmer[],8,FALSE),\"\")","v":""},{"$f":"IF(E6<11,\"U11\",IF(E6<13,\"U13\",IF(E6<15,\"U15\",IF(E6<17,\"U17\",IF(E6<19,\"U19\",IF(E6<21,\"U21\",IF(E6<23,\"U23\",IF(E6<25,\"U25\",IF(E6<30,\"U30\",IF(E6<50,\"U50\",IF(E6<70,\"U70\",IF(E6<99,\"70+\",\"\"))))))))))))","v":""},{"$f":"IFERROR(VLOOKUP(B6,Meldung!A3:AH52,34,FALSE),\"\")","v":""},null,null,null,null,"ja"]
{"$rows_left_out":30}
{"sheet":"Paarkür","index":5,"n_rows":46,"n_cols":15,"rows_kept":46,"cut":false,"hidden":true,"merged":[[40,8,41,8],[42,8,43,8],[44,8,45,8],[28,8,29,8],[30,8,31,8],[32,8,33,8],[34,8,35,8],[36,8,37,8],[38,8,39,8],[26,8,27,8],[14,8,15,8],[4,8,5,8],[6,8,7,8],[8,8,9,8],[10,8,11,8],[12,8,13,8],[16,8,17,8],[18,8,19,8],[20,8,21,8],[22,8,23,8],[24,8,25,8],[4,9,5,9],[6,9,7,9],[8,9,9,9],[10,9,11,9],[12,9,13,9],[14,9,15,9],[16,9,17,9],[18,9,19,9],[20,9,21,9],[22,9,23,9],[24,9,25,9],[26,9,27,9],[28,9,29,9],[30,9,31,9],[32,9,33,9],[44,9,45,9],[34,9,35,9],[36,9,37,9],[38,9,39,9],[40,9,41,9],[42,9,43,9]]}
["Süddeutsche Meisterschaft Einrad Freestyle 🧡"]
["Paarkür.",null,null,{"$f":"Meldung!V1","v":"16.10.2026"},{"$f":"Deckblatt!C2","v":"2026-10-18"}]
[]
["Kür Nr.","Spalte1","lf.Nr. Anmeldung","Name","Vorname","Alter","Alter_2","Kürname","Altersklasse","Altersklassensprung *\nzum nächsten Wettkampf"]
[1,1,{"$f":"IFERROR(INDEX(Teilnehmer[Lfd. Nr.],_xlfn.AGGREGATE(15,6,ROW(Teilnehmer[Lfd. Nr.])/((Teilnehmer[Paarkür]=A5)),ROW()-4)-1,1),\"\")","v":""},{"$f":"IFERROR(VLOOKUP(C5,Teilnehmer[],2,FALSE),\"\")","v":""},{"$f":"IFERROR(VLOOKUP(C5,Teilnehmer[],3,FALSE),\"\")","v":""},{"$f":"IFERROR(VLOOKUP(C5,Teilnehmer[],5,FALSE),\"\")","v":""},{"$f":"IFERROR(VLOOKUP(C5,Meldung!$A$2:$AE$51,31,FALSE),\"\")","v":""},{"$f":"IFERROR(VLOOKUP(C5,Teilnehmer[],10,FALSE),\"\")","v":""},{"$f":"IF(Tabelle_Paarkür[[#This Row],[Name]]=\"\",\"\",IF(MAX(F5,F6)<11,\"U11\",IF(MAX(F5,F6)<13,\"U13\",IF(MAX(F5,F6)<15,\"U15\",IF(MAX(F5,F6)<17,\"U17\",IF(MAX(F5,F6)<19,\"U19\",IF(MAX(F5,F6)<21,\"U21\",IF(MAX(F5,F6)<23,\"U23\",IF(MAX(F5,F6)<25,\"U25\",IF(MAX(F5,F6)<30,\"U30\",IF(MAX(F5,F6)<50,\"U50\",IF(MAX(F5,F6)<70,\"U70\",IF(MAX(F5,F6)<99,\" 70+\",\"\")))))))))))))","v":""},{"$f":"IF(IF(Tabelle_Paarkür[[#This Row],[Name]]=\"\",\"\",IF(MAX(G5,G6)<11,\"U11\",IF(MAX(G5,G6)<13,\"U13\",IF(MAX(G5,G6)<15,\"U15\",IF(MAX(G5,G6)<17,\"U17\",IF(MAX(G5,G6)<19,\"U19\",IF(MAX(G5,G6)<21,\"U21\",IF(MAX(G5,G6)<23,\"U23\",IF(MAX(G5,G6)<25,\"U25\",IF(MAX(G5,G6)<30,\"U30\",IF(MAX(G5,G6)<50,\"U50\",IF(MAX(G5,G6)<70,\"U70\",IF(MAX(G5,G6)<99,\"70+\",\"\")))))))))))))=I5,\"\",\"*\")","v":""},2,null,null,null,"nein"]
[null,2,{"$f":"IFERROR(INDEX(Teilnehmer[Lfd. Nr.],_xlfn.AGGREGATE(15,6,ROW(Teilnehmer[Lfd. Nr.])/((Teilnehmer[Paarkür]=A5)),ROW()-4)-1,1),\"\")","v":""},{"$f":"IFERROR(VLOOKUP(C6,Teilnehmer[],2,FALSE),\"\")","v":""},{"$f":"IFERROR(VLOOKUP(C6,Teilnehmer[],3,FALSE),\"\")","v":""},{"$f":"IFERROR(VLOOKUP(C6,Teilnehmer[],5,FALSE),\"\")","v":""},{"$f":"IFERROR(VLOOKUP(C6,Meldung!$A$2:$AE$51,31,FALSE),\"\")","v":""},{"$f":"IFERROR(VLOOKUP(C6,Teilnehmer[],10,FALSE),\"\")","v":""},null,null,null,null,null,null,"ja"]
{"$rows_left_out":41}
{"sheet":"Kleingrp","index":6,"n_rows":105,"n_cols":15,"rows_kept":105,"cut":false,"hidden":true,"merged":[[91,5,102,5],[72,2,72,4],[89,2,89,4],[1,4,1,5],[4,2,4,4],[21,2,21,4],[38,2,38,4],[55,2,55,4],[6,5,17,5],[23,5,34,5],[40,5,51,5],[57,5,68,5],[74,5,85,5],[1,2,1,3]]}
["Süddeutsche Meisterschaft Einrad Freestyle 🧡"]
["Kleingruppe.",null,{"$f":"Deckblatt!C2","v":"2026-10-18"}]
[]
["Kleingruppe",null,{"$f":"IFERROR(IF(Deckblatt!$C$9=0,\"\",Deckblatt!$C$9),\"\")","v":""},null,"KG1",null,null,null,null,"KürNr.","älterste Fahrer","Kürname","Verein","Anzahl Fahrer","Anzahl Fahrer2"]
["Name:",null,null,null,null,null,null,{"$f":"OR(AND(ISBLANK($C$5),$C$7<>\"\"),AND($N$5=0,$C$5<>\"\"))","v":false},null,{"$f":"E4","v":"KG1"},{"$f":"IF(ISBLANK($C$5)=TRUE,\"\",MAX(Tabelle182[Alter am 01.04.]))","v":""},{"$f":"IF(ISBLANK($C$5)=TRUE,\"\",$C$5)","v":""},{"$f":"C4","v":""},{"$f":"COUNT(E7:E18)","v":0},{"$f":"SUBTOTAL(102,Tabelle182[Alter am 01.04.])","v":0}]
["Fahrer","lf.Nr.","Name","Vorname","Alter am 01.04.","Altersklasse",null,null,null,{"$f":"E21","v":"KG2"},{"$f":"IF(ISBLANK($C$22)=TRUE,\"\",MAX(Tabelle18211[Alter am 01.04.]))","v":""},{"$f":"IF(ISBLANK($C$22)=TRUE,\"\",$C$22)","v":""},{"$f":"C21","v":""},{"$f":"COUNT(E24:E35)","v":0},{"$f":"SUBTOTAL(102,Tabelle18211[Alter am 01.04.])","v":0}]
{"$rows_left_out":100}
{"sheet":"Großgrp","index":7,"n_rows":61,"n_cols":30,"rows_kept":61,"cut":false,"hidden":true,"merged":[[6,19,29,19],[35,19,58,19],[35,12,58,12],[35,5,58,5],[1,4,1,7],[4,2,4,4],[4,9,4,11],[4,16,4,18],[33,2,33,4],[33,9,33,11],[33,16,33,18],[6,5,29,5],[6,12,29,12],[1,2,1,3]]}
["Süddeutsche Meisterschaft Einrad Freestyle 🧡"]
["Großgruppe.",null,{"$f":"Deckblatt!C2","v":"2026-10-18"}]
[]
["Großgruppe",null,{"$f":"IFERROR(IF(Deckblatt!$C$9=0,\"\",Deckblatt!$C$9),\"\")","v":""},null,"GG1",null,null,"Großgruppe",null,{"$f":"IFERROR(IF(Deckblatt!$C$9=0,\"\",Deckblatt!$C$9),\"\")","v":""},null,"GG2",null,null,"Großgruppe",null,{"$f":"IFERROR(IF(Deckblatt!$C$9=0,\"\",Deckblatt!$C$9),\"\")","v":""},null,"GG3",null,null,null,null,null,"KürNr.","älterste Fahrer","Kürname","Verein","Anzahl Fahrer","Anzahl Fahrer2"]
["Name:",null,null,null,null,null,null,"Name:",null,null,null,null,null,null,"Name:",null,null,null,null,null,null,{"$f":"OR(AND(ISBLANK($C$5),$C$7<>\"\"),AND($AC$5=0,$C$5<>\"\"))","v":false},{"$f":"OR(AND(ISBLANK($J$5),$J$7<>\"\"),AND($AC$6=0,$J$5<>\"\"))","v":false},{"$f":"OR(AND(ISBLANK($Q$5),$Q$7<>\"\"),AND($AC$7=0,$Q$5<>\"\"))","v":false},{"$f":"E4","v":"GG1"},{"$f":"IF(ISBLANK($C$5)=TRUE,\"\",MAX(Tabelle18214[Alter am 01.04.]))","v":""},{"$f":"IF(ISBLANK($C$5)=TRUE,\"\",$C$5)","v":""},{"$f":"C4","v":""},{"$f":"COUNT(Tabelle18214[Alter am 01.04.])","v":0},{"$f":"SUBTOTAL(102,Tabelle18214[Alter am 01.04.])","v":0}]
["Fahrer","lf.Nr.","Name","Vorname","Alter am 01.04.","Altersklasse",null,"Fahrer","lf.Nr.","Name","Vorname","Alter am 01.04.","Altersklasse",null,"Fahrer","lf.Nr.","Name","Vorname","Alter am 01.04.","Altersklasse",null,null,null,null,{"$f":"L4","v":"GG2"},{"$f":"IF(ISBLANK($J$5)=TRUE,\"\",MAX(Tabelle1821115[Alter am 01.04.]))","v":""},{"$f":"IF(ISBLANK($J$5)=TRUE,\"\",$J$5)","v":""},{"$f":"J4","v":""},{"$f":"COUNT(Tabelle1821115[Alter am 01.04.])","v":0},{"$f":"SUBTOTAL(102,Tabelle1821115[Alter am 01.04.])","v":0}]
{"$rows_left_out":56}
{"sheet":"Juryabfrage","index":8,"n_rows":108,"n_cols":70,"rows_kept":108,"cut":false,"hidden":true,"merged":[[4,16,4,18],[35,4,35,6],[54,2,54,3],[54,4,54,6],[23,58,24,58],[23,52,24,52],[23,55,24,55],[23,46,24,46],[23,49,24,49],[5,53,6,53],[5,54,6,54],[5,20,6,20],[5,21,6,21],[5,22,6,22],[5,23,6,23],[5,24,6,24],[5,25,6,25],[5,26,6,26],[5,55,6,55],[5,48,6,48],[5,49,6,49],[5,13,6,13],[5,14,6,14],[5,15,6,15],[3,49,3,60],[5,43,6,43],[5,44,6,44],[5,45,6,45],[5,46,6,46],[5,47,6,47],[4,31,4,33],[5,32,6,32],[5,33,6,33],[3,31,3,48],[2,31,2,60],[5,56,6,56],[5,27,6,27],[5,57,6,57],[5,58,6,58],[5,59,6,59],[5,60,6,60],[2,13,2,30],[3,7,3,30],[5,37,6,37],[5,38,6,38],[5,39,6,39],[5,40,6,40],[5,41,6,41],[5,42,6,42],[4,37,4,39],[5,9,6,9],[5,10,6,10],[5,31,6,31],[4,25,4,27],[4,28,4,30],[4,13,4,15],[4,19,4,21],[4,22,4,24],[5,1,6,1],[4,5,4,6],[23,1,24,1],[23,6,24,6],[4,1,4,4],[5,12,6,12],[23,7,24,7],[23,10,24,10],[5,7,6,7],[4,10,4,12],[5,11,6,11],[23,8,24,9],[23,11,24,12],[104,4,104,5],[25,6,30,6],[7,6,22,6],[1,1,1,4],[4,7,4,9],[1,5,1,70],[4,58,4,60],[4,52,4,54],[4,34,4,36],[4,55,4,57],[4,43,4,45],[4,46,4,48],[2,7,2,12],[4,49,4,51],[4,40,4,42],[5,34,6,34],[5,35,6,35],[5,36,6,36],[5,51,6,51],[5,52,6,52],[5,8,6,8],[23,19,24,19],[23,22,24,22],[23,25,24,25],[23,14,24,15],[23,17,24,18],[23,20,24,21],[23,23,24,24],[23,13,24,13],[23,16,24,16],[5,29,6,29],[5,30,6,30],[23,56,24,57],[5,16,6,16],[23,41,24,42],[23,44,24,45],[23,47,24,48],[23,50,24,51],[23,53,24,54],[5,50,6,50],[5,28,6,28],[5,18,6,18],[5,19,6,19],[5,17,6,17],[23,26,24,27],[23,29,24,30],[23,59,24,60],[23,28,24,28],[23,31,24,31],[23,43,24,43],[23,34,24,34],[23,37,24,37],[23,40,24,40],[23,32,24,33],[23,35,24,36],[23,38,24,39]]}
[{"$f":"Deckblatt!B2","v":46311}]
[null,"Juryabfrage",null,null,null,"Süddeutsche Meisterschaft Einrad Freestyle 🧡"]
[null,"Der Verein",null,null,null,null,null,"Freitag, 16.10.26",null,null,null,null,null,"Samstag, 17. Oktober 2026",null,null,null,null,null,null,null,null,null,null,null,null,null,null,null,null,null,{"$f":"Deckblatt!C2","v":"2026-10-18"},null,null,null,null,null,null,null,null,null,null,null,null,null,null,null,null,null,null,null,null,null,null,null,null,null,null,null,null,null,"Ist Anzahl Juryeinsätze",null,{"$f":"SUM(BL8:BL23)","v":0}]
[null,{"$f":"IFERROR(IF(Deckblatt!C9=0,\"\",Deckblatt!C9),\"\")","v":""},null,null,null,null,null,"Vorläufe ",null,null,null,null,null,null,null,null,null,null,null,null,null,null,null,null,null,null,null,null,null,null,null,"Finale EK + PK",null,null,null,null,null,null,null,null,null,null,null,null,null,null,null,null,null,"Finale Gruppenkür",null,null,null,null,null,null,null,null,null,null,null,"Anzahl Meldungen",null,{"$f":"Startgebühr!C27","v":""}]
[null,"ist verpflichtet folgende Mindestanzahl Juryeinsätze für T/P \nmit ausgebildeten Juroren (Mindestalter 15 Jahre) zu stellen:",null,null,null,{"$f":"IFERROR(IF(Startgebühr!C28=0,\"\",Startgebühr!C28),\"\")","v":""},null,"Einzelkür (w)\nU11 /U13/U15",null,null,"Einzelkür (m) \nU11/U13/U15",null,null,"Einzelkür (w) \nU17/U19/U21",null,null,"Einzelkür (w) \nU23/U25/>U25",null,null,"Einzelkür (m) \nU17/U19/>U19",null,null,"Paarkür JExp\nU11/U13/U15",null,null,"Paarkür Exp 1\nU17/U19/U21",null,null,"Paarkür Exp 2\nU23/U25/>U25",null,null,"Einzelkür (w)\nJunior Expert",null,null,"Einzelkür (w)\nExpert",null,null,"Einzelkür (m)\nJunior Expert",null,null,"Einzelkür (m)\nExpert",null,null,"Paarkür\nJunior Expert",null,null,"Paarkür\nExpert",null,null,"Kleingruppe\nJunior Expert",null,null,"Kleingruppe\nExpert",null,null,"Großgruppe\nJunior Expert",null,null,"Großgruppe\nExpert",null,null,"Soll Anzahl Juryeinsätze",null,{"$f":"Startgebühr!C28","v":""}]
[null,"#","Ausgebildete Juroren",null,null,null,null,"A","T","P","A","T","P","A","T","P","A","T","P","A","T","P","A","T","P","A","T","P","A","T","P","A","T","P","A","T","P","A","T","P","A","T","P","A","T","P","A","T","P","A","T","P","A","T","P","A","T","P","A","T","P","Anzahl empfohlene Judges",null,{"$f":"ROUNDUP(BL4/4,0)","v":{"$error":"#VALUE!"}}]
{"$rows_left_out":103}
{"sheet":"Startgebühr","index":9,"n_rows":29,"n_cols":6,"rows_kept":29,"cut":false,"hidden":true,"merged":[[7,1,7,3],[28,4,29,5],[10,1,10,3],[11,1,11,3],[12,1,12,3],[13,1,13,3]]}
[null,"Süddeutsche Meisterschaft Einrad Freestyle 🧡"]
[null,{"$f":"Deckblatt!B2","v":"2026-10-16"},{"$f":"Deckblatt!C2","v":"2026-10-18"}]
[null,"Startgebühr."]
[]
[null,"Einrad.Anmeldung@tsv-ga.de"]
[]
{"$rows_left_out":24}
{"sheet":"Kürmusik","index":10,"n_rows":22,"n_cols":5,"rows_kept":22,"cut":false,"hidden":true,"merged":[[6,1,6,5]]}
[null,"Süddeutsche Meisterschaft Einrad Freestyle 🧡"]
[null,{"$f":"Deckblatt!B2","v":"2026-10-16"},{"$f":"Deckblatt!C2","v":"2026-10-18"}]
[null,"Kürmusik."]
[]
[null,"Einrad.Musik@tsv-ga.de"]
[]
{"$rows_left_out":17}
{"sheet":"Ausfüll-Hilfe","index":11,"n_rows":27,"n_cols":6,"rows_kept":27,"cut":false,"hidden":true,"merged":[[0,1,0,23],[26,1,26,2]]}
[null,"Süddeutsche Meisterschaft Einrad Freestyle 🧡"]
[]
[null,"Schritt-für-Schritt-Anleitung. 😊"]
[]
[null,"Schritt 1:","Deckblatt",null,"--> Bitte die acht grauen Felder ausfüllen: Verein & Kontakt-Daten."]
[]
{"$rows_left_out":22}
{"sheet":"Check-Liste","index":12,"n_rows":43,"n_cols":4,"rows_kept":43,"cut":false,"hidden":true,"merged":[]}
["Übergreifend:",null,"umgesetzt","getestet"]
[null,"Ausfüll-HILFE / Anleitung","umgesetzt"]
[null,"Alter - Rot-Markierung weg, wenn Name nicht gefunden (Geburtsdaten-Datenbank)","umgesetzt"]
[null,"Alter - Datenbank mit Widersprüchen."]
[null,"Kleingruppe / Großgruppe: Altern nur U15 vs. 15+","umgesetzt"]
[]
{"$rows_left_out":38}
{"sheet":"Daten","index":13,"n_rows":309,"n_cols":6,"rows_kept":309,"cut":false,"hidden":true,"merged":[]}
["Textkette","Spalte1","Name","Vorname","Geb. datum","Datenbasis"]
[{"$f":"_xlfn.TEXTJOIN(\" \",TRUE,C2,D2)","v":"Joschko Antonia"},{"$f":"SUBSTITUTE(A2,\" \",\"\")","v":"JoschkoAntonia"},"Joschko","Antonia","2002-03-27",2022]
["Abendschön Emily",{"$f":"SUBSTITUTE(A3,\" \",\"\")","v":"AbendschönEmily"},"Abendschön","Emily","2003-06-06",2023]
["Abrantes Daniela","AbrantesDaniela","Abrantes","Daniela","2013-11-05",2023]
["Amslinger Angelina","AmslingerAngelina","Amslinger","Angelina","2006-03-01",2023]
["Augustin Sophie","AugustinSophie","Augustin","Sophie","2009-09-08",2023]
{"$rows_left_out":303}